Issue Text File Name Test Name
stress: stress-ng - os: Timeout Running '\/opt\/stress-ng\/stress-ng --wait 0 --timeout 5 --log-file wait\.log'\nstress-ng: info:\s*\[\d+\] setting to a \d+ second run per stressor\nstress-ng: info:\s*\[\d+\] dispatching hogs: \d+ wait$ taskout.log stress: stress-ng - os
Kernel panic: fs/jfs/jfs_logmgr.c:2313 assert(bp->l_flag & lbmRELEASE) BUG at fs\/jfs\/jfs_logmgr\.c:\d+ assert\(bp->l_flag & lbmRELEASE\) console.log selinux-policy: serge-testsuite
Storage blktests - srp: Timeout Start to run test case use_siw=1 srp: \S+srp\/002 \.+\nsrp\/002 \(File I\/O on top of multipath concurrently with logout and login \(mq\)\)$ taskout.log Storage blktests.*
redhat-rpm-config: detect-kabi-provides sanity: There should be 10 kernel(xxx) symbols (Assert: '0' should equal '10') There should be 10 kernel\(xxx\) symbols \(Assert: '0' should equal '10'\) taskout\.log redhat-rpm-config: detect-kabi-provides sanity
module diff: vmwgfx.ko is missing on kernel 5.14.0-7.el9 vmwgfx\.ko moduleList_missing\.log Module diff test
mod_ssl-smoke: missing python2 Error: Unable to find a match: python2 harness\.log httpd: mod_ssl smoke sanity
stress: stress-ng - os: Timeout Running '\/opt\/stress-ng\/stress-ng --bigheap 0 --timeout 5 --log-file bigheap\.log'\nstress-ng: info: \[\d+\] setting to a \d+ second run per stressor\nstress-ng: info: \[\d+\] dispatching hogs: \d+ bigheap$ taskout.log stress: stress-ng - os
Podman: 270-socket-activation.bats: FAIL: podman service responds normally podman run -d quay\.io\/libpod\/testimage:\d+ sleep \d+\s*\[\+\d+s\] # \S+\s*\[\+\d+s\] # #\/v+\s*\[\+\d+s\] # #\|\s*FAIL: podman service responds normally taskout.log Podman.*
xfstest: No 'mkfs.ext4' is present in system ext4:mkfs_dev:no_mkfs FAIL taskout\.log xfstests - ext4
xfstests: generic/452 - +environment: line 1: which_declare: command not found environment: line \d+: which_declare: command not found generic-452.out.bad xfstests.*
storage: stqe-test: command not found stqe-test: command not found taskout\.log (storage|lvm)
Storage blktests - nvmeof-mp: Timeout nvmet: ctrl \d+ keep-alive timer \(\d+ seconds\) expired!\s*\[\s*\d+\.\d+\] nvmet: ctrl \d+ fatal error occurred test_console.log Storage blktests - nvmeof-mp
[RHEL-8.6]kdump kernel failed to save vmcore-dmesg.txt and report 'Missing the log_buf symbol' kdump\.sh\[\d+\]: Missing the log_buf symbol\s*\n\[\s*\S+\s*\] kdump\[\d+\]: saving vmcore-dmesg\.txt failed console\.log kdump - sysrq-c
Oops: kernel/sched/fair.c:10943 cfs_prio_less+0x578/0x894 kernel\/sched\/fair\.c:\d+ cfs_pri\s*o_less\+\S+\/\S+ console.log stress: stress-ng - os
Kernel panic: srp_process_rsp+0xb4/0x2e0 Call trace:\s*\[\s*\d+\.\d+\]\s*srp_process_rsp\+\S+\/\S+ \[ib_srp\] console.log Storage blktests - srp
Storage blktests srp/014 hang at "ib_srpt enP5p1s0f0_siw_1: waiting for unregistration of 128 sessions Start to run test case use_siw=1 srp: \S+\/014 \.\.\.\s*srp\/014 \(Run sg_reset while I\/O is ongoing\)\s+srp\/014 \(Run sg_reset while I\/O is ongoing\)\s+\[passed\]\s+runtime\s+\.\.\.\s+\d+\.\d+s$ taskout.log Storage blktests - srp
BUG: KASAN: use-after-free in string_nocheck MAX_LOCKDEP_CHAIN_HLOCKS\nBUG: KASAN: use-after-free in string_nocheck\nwatchdog: BUG: soft lockup - CPU resultoutputfile.log LTP.*
LTP: openposix: conformance/interfaces/clock/clock_1-1 FAILED conformance\/interfaces\/clock\/clock_1-1: execution: FAILED: Output:\s*Error with processor times T1=\d+\.\d+, T2=\d+\.\d+ logfile.conformance-test LTP: openposix.*
Podman: exec container process `/bin/sh`: Exec format error # exec container process `\/bin\/sh`: Exec format error\n\[\S+\] # Error: error building at STEP "RUN echo -e "#!\/bin\/sh\\nprintenv NOTIFY_SOCKET; echo READY; systemd-notify --ready;\\ntrap 'echo Received SIGTERM, finishing; exit' SIGTERM; echo WAITING; while :; do sleep \S+; done" >> \/runme": error while running taskout\.log Podman system test.*
Podman: 160-volumes.bats: Error: Could not create tarball file podman volume export my_vol --output=\S+\.tar\n\[\+\d+s\]\s*#\s*Error: Could not create tarball file '\S+\.tar': open \S+\.tar: permission denied\n\[\+\d+s\]\s*#\s*\[ rc=125 taskout.log Podman.*
Networking cki netfilter test: unknown option "--to-destination" iptables v\S+ \(nf_tables\): unknown option "--to-destination" taskout\.log Networking cki netfilter test
Networking TCP: keepalive test: fail: kalive_pkts should equal 10 \[\s+FAIL\s+\] :: fail: kalive_pkts should equal 10 taskout\.log Networking TCP: keepalive test
LTP: /mnt/testarea/ltp/runltp: No such file or directory \/mnt\/testarea\/ltp\/runltp: No such file or directory taskout\.log LTP lite
LTP: openposix test suite: pthread_kill_6-1: execution: FAILED conformance\/interfaces\/pthread_kill\/pthread_kill_6-1: execution: FAILED: Output:\s+\nTest Fail logfile\.conformance-test LTP: openposix test suite
lvm cache test: kworker/u16:3: page allocation failure: order:0, mode:0x400000(GFP_NOWAIT), nodemask=(null),cpuset=/,mems_allowed=0 kworker\/u\d+:\d+: page allocation failure: order:0, mode:0x400000\(GFP_NOWAIT\), nodemask=\(null\),cpuset=\/,mems_allowed=0 dmesg\.log lvm cache test
jvm - jcstress tests: [VM ERROR] org.sample.ConcurrencyTest \[VM ERROR\] org\.sample\.ConcurrencyTest taskout\.log jvm - jcstress tests
LTP: openposix test suite - FAIL: SIGUSR1 is member of new thread pendingset conformance\/interfaces\/pthread_create\/pthread_create_8-1: execution: FAILED: Output:\s*\nFAIL: SIGUSR1 is member of new thread pendingset logfile\.conformance-test LTP: openposix test suite
LTP: openposix test suite: io_listio/2-1.c Error lio_listio() waited for list completion lio_listio\/2-1\.c Error lio_listio\(\) waited for list completion logfile\.conformance-test LTP: openposix test suite
Module diff test: `qrtr.ko`module is missing on aarch64, ppc64le and s390x qrtr\.ko moduleList_missing\.log Module diff test
LTP cve: pty03.c:106: TINFO: Creating PTY with SLIP line discipline timeout pty03\.c:\d+: TINFO: Creating PTY with SLIP line discipline\n\s+\d+\s+Test timeouted, sending SIGKILL! cve\.fail\.log LTP - cve