Issue Text File Name Test Name Subtest Name Architecture Package Name Tree Name KPET Tree Name
[upstream] [clang] kselftest being built using gcc for clang built kernel gcc -Wp selftests.*\.log kselftest build .*     clang  
[rhel8-rt] RIP: 0010:rt_spin_lock+0x5b/0xf0 - __put_task_struct+0x75/0x120 __put_task_struct\+0x\S+/0x\S+ journalctl\.log Boot test|Reboot test journalctl-check   kernel-rt-debug   rhel8[0-9]-z
Hardware - pciutils: update pci ids test: update-pciids: decompression failed, probably truncated file update-pciids: decompression failed, probably truncated file taskout\.log Hardware - pciutils: update pci ids test Testing        
[RHEL-10] kunit - RIP: 0010:memmove+0x28/0x1b0 Krnl PSW : \S+ \S+ \(memmove\+0x\S+/0x\S+\) console\.log KUNIT Panic s390x   rhel-10  
[RHEL-10] kunit - RIP: 0010:memmove+0x28/0x1b0 kernel BUG at lib/list_debug.c console\.log KUNIT Panic aarch64   rhel-10  
[RHEL-10] kunit - RIP: 0010:memmove+0x28/0x1b0 RIP: 0010:memmove\+0x\S+/0x\S+ console\.log KUNIT Panic     rhel-10  
[RHEL-10] kunit - # RFC 6803 key derivation: ASSERTION FAILED at net/sunrpc/auth_gss/gss_krb5_test.c:63 RFC 6803 key derivation: ASSERTION FAILED at net/sunrpc/auth_gss/gss_krb5_test\.c:\d+ RFC_6803_suite\.log KUNIT process-RFC-6803-suite     rhel-10  
[RHEL-10] WARNING: CPU: 4 PID: 1 at net/core/skbuff.c:289 napi_get_frags_check+0x50/0x90 WARNING: CPU: \d+ PID: \d+ at net/core/skbuff\.c:\d+ napi_get_frags_check\+0x\S+/0x\S+ journalctl\.log Boot test|Reboot test journalctl-check     rhel-10  
[rhel-8.10] [ALDERLAKE] unchecked MSR access error: WRMSR to 0xd10 (tried to write 0x000000000000ffff) at rIP: 0xffffffff92e6e824 (native_write_msr+0x4/0x30) unchecked MSR access error: WRMSR to 0x\S+ \(tried to write 0x\S+\) at rIP: 0x\S+ \(native_write_msr\+0x\S+/0x\S+\) journalctl\.log Boot test|Reboot test check     rhel8  
[rhel-10] [ppc64le-debug] NIP [c0000000008231c0] kasan_release_object_meta+0x70/0xc4 LR [c000000000824a7c] qlist_free_all+0x94/0x198 NIP \[\S+\] kasan_release_object_meta\+0x\S+\/0x\S+ console\.log Boot test|Reboot test Panic ppc64le   rhel-10  
[RHEL-8.9] avc: denied { read } for pid=598 comm="systemd-journal" name="invocation:chronyd.service" dev="tmpfs" ino=17130 scontext=system_u:system_r:syslogd_t:s0 tcontext=system_u:object_r:tmpfs_t:s0 tclass=lnk_file permissive=1 avc: denied { read } for pid=\d+ comm="systemd-journal" name="invocation:chronyd\.service" dev="tmpfs" ino=\d+ scontext=system_u:system_r:syslogd_t:s0 tcontext=system_u:object_r:tmpfs_t:s0 tclass=lnk_file permissive=\d+ avc\.log .* /10_avc_check       rhel89-z
[RHEL-10] avc denials, because uses eln compose eln avc\.log .* /10_avc_check     rhel-10  
[RHEL-10] [LTP lite] fails due to using ELN compose Fedora ELN taskout\.log LTP lite .*     rhel-10  
filesystems/nfs/connectathon/rhel8-nfs.eng.rdu2.redhat.com : Time exceeded 1500 seconds Time exceeded 1500 seconds resultoutputfile\.log filesystems\/nfs\/connectathon filesystems\/nfs\/connectathon        
Unable to handle kernel NULL pointer dereference at virtual address 0000000000000070 Workqueue: md_misc md_start_sync console\.log Storage - swraid scsi_raid Test        
[upstream] [eln] waived call traces we don't plan to report upstream WARNING: CPU: \d+ PID: \d+ at drivers/net/ethernet/mellanox/mlx5/core/en_main\.c:\d+ mlx5e_attach_netdev\+0x\S+/0x\S+ \[mlx5_core\] journalctl\.log|dmesg\.log .* check       (fedora-latest|rawhide|eln)
[RHEL-9.0] kernel panic when run elevator switch stress test - RIP: 0010:scsi_mq_exit_request+0x14/0x40 pc : scsi_mq_exit_request\+0x\S+/0x\S+ console\.log Storage - blktests - srp Panic aarch64     rhel9[01]-z
[RHEL-9.0] kernel panic when run elevator switch stress test - RIP: 0010:scsi_mq_exit_request+0x14/0x40 RIP: 0010:scsi_mq_exit_request\+0x\S+/0x\S+ console\.log Storage - blktests - srp Panic       rhel9[01]-z
[rhel9] BUG: KFENCE: memory corruption in alua_rtpg+0x61c/0x8b0 - Panic pc : __kmalloc+0xe0/0x330 - pc : __kmem_cache_alloc_node+0x1b8/0x33c pc : kmem_cache_alloc_trace\+0x\S+/0x\S+ console\.log Storage - blktests - srp Panic aarch64 kernel-64k|kernel-64k-debug (rhel9|c9s)  
[rawhide] [s390x] avc: denied { read write } for pid=12701 comm="systemd-user-ru" name="z90crypt" dev="devtmpfs" ino=103 scontext=system_u:system_r:systemd_logind_t:s0 tcontext=system_u:object_r:crypt_device_t:s0 tclass=chr_file permissive=1 avc: denied { ioctl } for pid=\d+ comm="systemd-sysctl" path="/dev/z90crypt" dev="devtmpfs" ino=\d+ ioctlcmd=0x\S+ scontext=system_u:system_r:systemd_sysctl_t:s0-s0:c0.c1023 tcontext=system_u:object_r:crypt_device_t:s0 tclass=chr_file permissive=\d+ avc\.log .* /10_avc_check s390x     (fedora-latest|rawhide|eln)
[rawhide] [s390x] avc: denied { read write } for pid=12701 comm="systemd-user-ru" name="z90crypt" dev="devtmpfs" ino=103 scontext=system_u:system_r:systemd_logind_t:s0 tcontext=system_u:object_r:crypt_device_t:s0 tclass=chr_file permissive=1 avc: denied { ioctl } for pid=\d+ comm="unbound-anchor" path="/dev/z90crypt" dev="devtmpfs" ino=99 ioctlcmd=\S+ scontext=system_u:system_r:named_t:s0 tcontext=system_u:object_r:crypt_device_t:s0 tclass=chr_file permissive=\d+ avc\.log .* /10_avc_check s390x     (fedora-latest|rawhide|eln)
[upstream] KUNIT - RFC 6803 suite - RFC 6803 key derivation: ASSERTION FAILED at net/sunrpc/auth_gss/gss_krb5_test.c:63 RFC 6803 key derivation: ASSERTION FAILED at net/sunrpc/auth_gss/gss_krb5_test\.c:\d+ RFC_6803_suite\.log KUNIT process-RFC-6803-suite       (fedora-latest|rawhide|eln)
[upstream] [s390x] KUNIT: drm_format_helper_test - drm_test_fb_xrgb8888_to_xrgb2101010: EXPECTATION FAILED at drivers/gpu/drm/tests/drm_format_helper_test.c:1006 drm_test_fb_xrgb8888_to_xrgb2101010: EXPECTATION FAILED at drivers/gpu/drm/tests/drm_format_helper_test\.c:\d+ drm_format_helper_test.log KUNIT process-drm-format-helper-test s390x     (fedora-latest|rawhide|eln)
[upstream] [s390x] KUNIT: clk-gate-test - clk_gate_test_enable: EXPECTATION FAILED at drivers/clk/clk-gate_test.c:169 clk_gate_test_enable: EXPECTATION FAILED at drivers/clk/clk-gate_test\.c:\d+ clk-gate-test\.log KUNIT process-clk-gate-test s390x     (fedora-latest|rawhide|eln)
[upstream] [s390x] KUNIT: clk-gate-is_enabled-test - clk_gate_test_is_disabled: ASSERTION FAILED at drivers/clk/clk-gate_test.c:409 clk_gate_test_is_disabled: ASSERTION FAILED at drivers/clk/clk-gate_test\.c:\d+ clk-gate-is_enabled-test\.log KUNIT process-clk-gate-is-enabled-test s390x     (fedora-latest|rawhide|eln)
[upstream] [s390x] KUNIT: clk-gate-invert-test - clk_gate_test_invert_enable: EXPECTATION FAILED at drivers/clk/clk-gate_test.c:249 clk_gate_test_invert_enable: EXPECTATION FAILED at drivers/clk/clk-gate_test\.c:\d+ clk-gate-invert-test\.log KUNIT process-clk-gate-invert-test s390x     (fedora-latest|rawhide|eln)
[upstream] [s390x] KUNIT: checksum - test_ip_fast_csum: ASSERTION FAILED at lib/checksum_kunit.c:589 test_ip_fast_csum: ASSERTION FAILED at lib/checksum_kunit\.c:\d+ checksum\.log KUNIT process-checksum s390x     (fedora-latest|rawhide|eln)
[upstream] blktests tests/zbd/010 failed (WARNING: CPU: 22 PID: 44011 at fs/iomap/iter.c:51) WARNING: CPU: \d+ PID: \d+ at fs\/iomap\/iter.c:\d+ iomap_iter dmesg\.log Storage - blktests zbd/010       (fedora-latest|rawhide|eln)
[upstream] blktests tests nbd/001 failed nbd0 43:0 0 10G 0 disk 001.out.bad Storage - blktests nbd/001       (fedora-latest|rawhide|eln)
module diff test: remove nft_counter.ko and nft_objref.ko on rhel9 nft_objref\.ko moduleList_missing\.log Module diff test Missing-loadable-module-nft-objref-ko     (rhel9|c9s)